Items which appear similar to one other. Review for duplicates or vague titles.

Similar Pull Requests (2)

Resolution: Close as duplicate or give a better title

Average age: 2.7d, Avg wait: 0.0d
ID Au Desc As Rea Cr Up Re Cmntrs Labels Tags
18687 Site: Update hugo from v0.124.1 to v0.125.2 4d 22h 4d
cncf-cla: yes
size/XS
needs-ok-to-test
do-not-merge/hold
commented
member-last
send
similar
unreviewed
18707 [Multi-OS Cluster]: Windows Node Support in Minikube Proposal 23h 23h 23h
cncf-cla: yes
size/M
needs-ok-to-test
collaborator-last
recv
similar
unreviewed

Similar Issues (303)

Resolution: Close as duplicate or give a better title

Average age: 515.4d, Avg wait: 26.6d
ID Au Desc As Rea Cr Up Re Cmntrs Labels Tags
18714 Failed to start Minikube on hyper-v 20h 3h 8h
co/hyperv
triage/needs-information
author-last
commented
recv
similar
18686 minikube logs --file=log.tx thats issue 4d 8h 8h
kind/support
triage/needs-information
commented
member-last
send
similar
18679 IP minikube 4d 4d 4d
recv
similar
18678 minikube 5d 5d 5d
recv
similar
18633 error with enabling ingress on minikube 10d 8d 10d
kind/support
member-last
recv
similar
18630 Frequent test failures of `TestDownloadOnly/v1.30.0-rc.2/cached-images` 10d 10d
priority/backlog
kind/failing-test
similar
18629 Frequent test failures of `TestDownloadOnly/v1.30.0-rc.2/binaries` 10d 9d
priority/backlog
kind/failing-test
similar
18625 minikube fails to start on macos Sonoma 11d 6h 10d
kind/support
author-last
commented
recv
recv-q
similar
18613 Minikube v1.32.0 does not run on OSX Sonoma v14.4.1 12d 2d 12d
author-last
recv
similar
18612 E0410 12:29:22.543247 3714 cache.go:189] Error downloading kic artifacts: not yet implemented, see issue #8426 12d 12d 12d
recv
similar
18605 Frequent test failures of `TestDownloadOnly/v1.30.0-rc.1/preload-exists` 14d 14d
priority/backlog
kind/failing-test
similar
18604 Frequent test failures of `TestDownloadOnly/v1.30.0-rc.1/kubectl` 14d 14d
priority/backlog
kind/failing-test
similar
18603 Frequent test failures of `TestDownloadOnly/v1.30.0-rc.1/json-events` 14d 14d
priority/backlog
kind/failing-test
similar
18589 minikube start 16d 13d 16d
kind/support
triage/duplicate
triage/needs-information
member-last
recv
similar
18568 Exiting due to GUEST_STATUS: Unable to get machine status: state: unknown state "minikube": docker container inspect minikube --format=<no value>: exit status 1 19d 19d 19d
kind/support
member-last
recv
recv-q
similar
18537 unable to start minikube and run kubectl get pods 3wk 14d 3wk
kind/support
member-last
recv
similar
18529 Exiting due to K8S_INSTALL_FAILED: Failed to update cluster: updating control plane: downloading binaries: downloading kubelet: download failed 3wk 3wk 3wk
recv
similar
18526 minikube installation error 3wk 19d 3wk
triage/needs-information
l/ar
member-last
recv
recv-q
similar
18525 unable to enable ingress addon 3wk 3wk 3wk
recv
similar
18512 Not able to start minikube 3wk 14d 3wk
kind/support
member-last
recv
similar
18491 Failing to start minikube on MacOS 4wk 4wk 4wk
commented
member-last
send
similar
18483 Frequent test failures of `TestScheduledStopWindows` 4wk 2h
priority/backlog
kind/failing-test
similar
18480 Frequent test failures of `TestKicCustomSubnet` 4wk 2h
priority/backlog
kind/failing-test
similar
18479 Frequent test failures of `TestKicCustomNetwork/use_default_bridge_network` 4wk 2h
priority/backlog
kind/failing-test
similar
18478 Frequent test failures of `TestKicCustomNetwork/create_custom_network` 4wk 2h
priority/backlog
kind/failing-test
similar
18477 Frequent test failures of `TestFunctional/serial/CacheCmd/cache/list` 4wk 2h
priority/backlog
kind/failing-test
similar
18476 Frequent test failures of `TestFunctional/serial/CacheCmd/cache/delete` 4wk 2h
priority/backlog
kind/failing-test
similar
18475 Frequent test failures of `TestFunctional/serial/CacheCmd/cache/CacheDelete` 4wk 2h
priority/backlog
kind/failing-test
similar
18474 Frequent test failures of `TestFunctional/serial/CacheCmd/cache/add_remote` 4wk 2h
priority/backlog
kind/failing-test
similar
18467 Frequent test failures of `TestDownloadOnly/v1.20.0/preload-exists` 4wk 2h
priority/backlog
kind/failing-test
similar
18459 Cannot run minikube start 4wk 4wk 4wk
recv
similar
18451 unable to start minikube on windows 10 Enterprise LTSC 21H2 Build: 19044.4170 4wk 4wk 4wk
l/fr
recv
similar
18447 Frequent test failures of `TestDownloadOnly/v1.29.3/preload-exists` 4wk 8h
priority/backlog
kind/failing-test
similar
18446 Frequent test failures of `TestDownloadOnly/v1.29.3/kubectl` 4wk 8h
priority/backlog
kind/failing-test
similar
18445 Frequent test failures of `TestDownloadOnly/v1.29.3/json-events` 4wk 8h
priority/backlog
kind/failing-test
similar
18442 Unable to start minikube cluster 5wk 14d 5wk
kind/support
member-last
recv
similar
18420 Exiting due to SVC_UNREACHABLE 5wk 14d 5wk
member-last
recv
similar
18419 service not available: no running pod for service node-app-service found 5wk 5wk 5wk
author-last
recv
similar
18412 minikube not starting 5wk 5wk 5wk
member-last
recv
similar
18411 Frequent test failures of `TestMultiControlPlane/serial/NodeLabels` 5wk 2h
priority/backlog
kind/failing-test
similar
18410 Frequent test failures of `TestMultiControlPlane/serial/HAppyAfterSecondaryNodeRestart` 5wk 2h
priority/backlog
kind/failing-test
similar
18409 Frequent test failures of `TestMultiControlPlane/serial/HAppyAfterClusterStart` 5wk 2h
priority/backlog
kind/failing-test
similar
18408 Frequent test failures of `TestMultiControlPlane/serial/DeleteSecondaryNode` 5wk 2h
priority/backlog
kind/failing-test
similar
18407 Frequent test failures of `TestMultiControlPlane/serial/DegradedAfterSecondaryNodeDelete` 5wk 2h
priority/backlog
kind/failing-test
similar
18406 Frequent test failures of `TestMultiControlPlane/serial/DegradedAfterControlPlaneNodeStop` 5wk 2h
priority/backlog
kind/failing-test
similar
18405 Frequent test failures of `TestMultiControlPlane/serial/CopyFile` 5wk 2h
priority/backlog
kind/failing-test
similar
18404 Frequent test failures of `TestMultiControlPlane/serial/StopSecondaryNode` 5wk 2h
priority/backlog
kind/failing-test
similar
18403 Frequent test failures of `TestMultiControlPlane/serial/StopCluster` 5wk 2h
priority/backlog
kind/failing-test
similar
18402 Frequent test failures of `TestMultiControlPlane/serial/StartCluster` 5wk 2h
priority/backlog
kind/failing-test
similar
18401 Frequent test failures of `TestMultiControlPlane/serial/RestartSecondaryNode` 5wk 2h
priority/backlog
kind/failing-test
similar
18400 Frequent test failures of `TestMultiControlPlane/serial/RestartClusterKeepsNodes` 5wk 2h
priority/backlog
kind/failing-test
similar
18399 Frequent test failures of `TestMultiControlPlane/serial/RestartCluster` 5wk 2h
priority/backlog
kind/failing-test
similar
18398 Frequent test failures of `TestMultiControlPlane/serial/PingHostFromPods` 5wk 2h
priority/backlog
kind/failing-test
similar
18397 Frequent test failures of `TestMultiControlPlane/serial/HAppyAfterSecondaryNodeAdd` 5wk 2h
priority/backlog
kind/failing-test
similar
18396 Frequent test failures of `TestMultiControlPlane/serial/DeployApp` 5wk 2h
priority/backlog
kind/failing-test
similar
18395 Frequent test failures of `TestMultiControlPlane/serial/DegradedAfterClusterRestart` 5wk 2h
priority/backlog
kind/failing-test
similar
18394 Frequent test failures of `TestMultiControlPlane/serial/AddWorkerNode` 5wk 2h
priority/backlog
kind/failing-test
similar
18393 Frequent test failures of `TestMultiControlPlane/serial/AddSecondaryNode` 5wk 2h
priority/backlog
kind/failing-test
similar
18392 Frequent test failures of `TestMultiControlPlane` 5wk 5wk
priority/backlog
kind/failing-test
similar
18380 Error minikube 5wk 5wk 5wk
l/id
recv
similar
18363 Exiting due to MK_ADDON_ENABLE: enable failed: run callbacks: metric-server is not a valid addon 5wk 5wk 5wk
member-last
recv
similar
18344 no running pod for service node--app found 6wk 6wk 6wk
kind/support
member-last
recv
similar
18340 Frequent test failures of `TestMultiNode` 6wk 6wk
priority/backlog
kind/failing-test
similar
18316 ะฒะพะทะฝะธะบะปะฐ ะฟั€ะพะฑะปะตะผะฐ ั ะทะฐะฟัƒัะบะพะผ ะฟั€ะพะบัะธ Minikube ะดะปั Kubernetes Dashboard 6wk 6wk 6wk
recv
similar
18312 minikube start 6wk 5wk 6wk
kind/support
member-last
recv
recv-q
similar
18311 minikube showing error 6wk 6wk 6wk
member-last
recv
similar
18305 Frequent test failures of `TestDownloadOnly/v1.20.0/kubectl` 7wk 2h
priority/backlog
kind/failing-test
similar
18304 Frequent test failures of `TestDownloadOnly/v1.20.0/json-events` 7wk 2h
priority/backlog
kind/failing-test
similar
18291 minikube start (path specification in documentation) 7wk 7wk 7wk
recv
similar
18276 Failed to enable minikube add on ingress 7wk 7wk 7wk
recv
similar
18270 Fermeture en raison de SVC_UNREACHABLE : service not available: no running pod for service mongo-express-service found 7wk 7wk 7wk
l/fr
recv
similar
18212 Exiting due to GUEST_PROVISION 2mo 2mo 2mo
recv
similar
18193 Problemas com minikube ao iniciar cluster 2mo 2mo 2mo
l/pt-BR
author-last
recv
similar
18176 Unable to run MiniKube in Windows System 2mo 2mo 2mo
author-last
recv
similar
18175 minikube error 2mo 2mo 2mo
recv
similar
18155 installing ingress controller on minikube 2mo 2mo 2mo
recv
similar
18117 minikube start with rootless docker failing 2mo 6wk 2mo
member-last
recv
similar
18108 install nginx ingress controller on minikube ubuntu 2mo 2mo 2mo
recv
similar
18094 Minikube failled to start while using docker as driver 2mo 2mo 2mo
recv
similar
18090 Unable to start my minikube cluster 2mo 2mo 2mo
recv
similar
18089 minikube Dashboard not opening
2mo 2mo 2mo
recv
similar
18085 Exiting due to GUEST_PROVISION: error provisioning guest: Failed to start host: provision: IP not found 2mo 2mo 2mo
recv
similar
18049 minikube start
2mo 2mo 2mo
member-last
recv
similar
18025 minikube crio-wipe
3mo 2mo 3mo
kind/bug
priority/important-longterm
co/runtime/crio
recv
similar
18008 Exiting due to SVC_UNREACHABLE: service not available: no running pod for service python-django-sample-app found 3mo 4d 3mo
lifecycle/stale
recv
similar
18002 minikube nginx ingress controller installation failed 3mo 2mo 3mo
kind/support
member-last
recv
recv-q
similar
17960 Exiting due to K8S_INSTALL_FAILED 3mo 8d 3mo
lifecycle/stale
recv
recv-q
similar
17948 This container is having trouble accessing https://k8s.gcr.io 3mo 11d 3mo
lifecycle/stale
recv
similar
17941 Getting below error while installing minikube in win 11 home. 3mo 11d 3mo
lifecycle/stale
recv
similar
17934 Exiting due to SVC_UNREACHABLE: service not available: no running pod for service webserver-service found 3mo 12d 3mo
lifecycle/stale
recv
similar
17932 Minikube not running 3mo 12d 3mo
lifecycle/stale
recv
similar
17922 โŒ Saliendo por un error GUEST_STATUS: Unable to get machine status: state: unknown state "minikube": sudo -n podman container inspect minikube --format=<no value>: exit status 125 3mo 13d 3mo
lifecycle/stale
l/es
recv
similar
17894 This container is having trouble accessing https://registry.k8s.io 3mo 2mo 3mo
recv
similar
17892 error 3mo 14d 3mo
kind/support
lifecycle/stale
member-last
recv
recv-q
similar
17888 ๅ›  SVC_UNREACHABLE ้”™่ฏฏ่€Œ้€€ๅ‡บ๏ผšservice not available: no running pod for service 3mo 16d 3mo
kind/support
lifecycle/stale
l/zh-CN
recv
similar
17864 โŒ Exiting due to DRV_MISSING_ADDRESS: Failed to start host: new host: dial tcp: missing address 3mo 2wk 3mo
lifecycle/stale
recv
recv-q
similar
17854 minikube start 4mo 3wk 4mo
lifecycle/stale
recv
recv-q
similar
17853 Can't start minikube v1.32.0, kubelet not found in $PATH 4mo 2wk 4mo
lifecycle/stale
recv
similar
17852 Error provisioning guest 4mo 2d 4mo
lifecycle/rotten
recv
similar
17850 minikube ingress addon can't be enabled
4mo 3wk 4mo
lifecycle/stale
recv
recv-q
similar
17841 Unable to start minikube on Windows 10 4mo 4d 4mo
lifecycle/rotten
recv
similar
17834 Error to Minikube Start 4mo 4d 4mo
kind/support
lifecycle/rotten
commented
send
similar
17825 minikube start fails with error and asks for reporting here 4mo 6d 4mo
lifecycle/rotten
recv
similar
17784 Minikube v1.32.0 not starting on Ubtuntu 22.04 4mo 11d 4mo
lifecycle/rotten
recv
similar
17783 https://github.com/kubernetes/minikube/issues/new/choose 4mo 11d 4mo
lifecycle/rotten
recv
similar
17782 Unable to enable ingress addon for Minikube 4mo 10d 4mo
lifecycle/rotten
recv
similar
17750 Unable to start minikube with parallels 4mo 17d 4mo
lifecycle/rotten
recv
similar
17743 Minikube 4mo 18d 4mo
lifecycle/rotten
l/fr
recv
similar
17728 not able to start minikube using docker driver 4mo 14d 4mo
kind/support
lifecycle/rotten
triage/needs-information
member-last
recv
recv-q
similar
17699 Unable to enable ingress addon in minikube on ubuntu with docker driver 4mo 3wk 4mo
lifecycle/rotten
recv
recv-q
similar
17694 https://github.com/kubernetes/minikube/issues/9130 4mo 13d 4mo
lifecycle/rotten
recv
similar
17693 Frequent test failures of `TestMultiNode/serial/MultiNodeLabels` 4mo 2h
priority/backlog
kind/failing-test
similar
17684 minikube fails to start on Mac with podman 4.8.0 (works with podman 4.7.2) 4mo 3wk 4mo
kind/bug
os/macos
lifecycle/rotten
co/podman-driver
commented
send
similar
17674 Unable start minikube on rashpberry using nix 4mo 3wk 4mo
lifecycle/rotten
commented
recv
similar
17672 Issue: Exiting due to MK_ADDON_ENABLE: enable failed: run callbacks: running callbacks 4mo 3wk 4mo
lifecycle/rotten
triage/duplicate
recv
similar
17661 ไฝฟ็”จ`$ minikube start --image-mirror-country="cn"`ๅ‘ฝไปคๅ‡บ็Žฐโ€œๅ›  K8S_INSTALL_FAILED ้”™่ฏฏ่€Œ้€€ๅ‡บ๏ผšFailed to update cluster: updating control plane: downloading binaries: downloading kubeadm: download failed:โ€้”™่ฏฏ
2
5mo 5wk 5mo
kind/support
l/zh-CN
recv
recv-q
similar
17587 Can not start minikube with the docker driver 5mo 13d 5mo
kind/bug
co/runtime/docker
os/linux
priority/awaiting-more-evidence
lifecycle/rotten
co/docker-driver
commented
send
similar
17579 minikube start --driver=podman --container-runtime=cri-o failing
5mo 3wk 5mo
os/windows
lifecycle/rotten
co/podman-driver
recv
similar
17492 Frequent test failures of `TestFunctional/parallel/DockerEnv/powershell` 6mo 2h
priority/backlog
kind/failing-test
similar
17460 Frequent test failures of `TestImageBuild/serial/Setup` 6mo 2h
priority/backlog
kind/failing-test
similar
17459 Frequent test failures of `TestFunctional/serial/InvalidService` 6mo 2h
priority/backlog
kind/failing-test
similar
17417 Exiting due to MK_ADDON_ENABLE: enable failed
6mo 2mo 6mo
author-last
recv
similar
17400 Error while running minikube start --driver=podman --container-runtime=containerd 6mo 3wk 6mo
os/linux
lifecycle/rotten
co/podman-driver
recv
similar
17397 downloading kubeadm ๅคฑ่ดฅ๏ผŒๆ— ๆณ•ๅฎŒๆˆ minikube start
6mo 16d 6mo
kind/support
lifecycle/stale
l/zh-CN
recv
similar
17389